Target
Coagulation factor X
Ligand
BDBM226060
Substrate
Meas. Tech.
D3R246
IC50
9.67±n/a nM
Citation
 D3R, DD GSK FactorXA-2 D3R 246:0 (2015) Target
Name:
Coagulation factor X
Synonyms:
Activated coagulation factor X (FXa) Coagulation factor X precursor F10 Factor X heavy chain Factor Xa Stuart-Prower factor
Type:
Enzyme
Mol. Mass.:
54726.60
Organism:
Homo sapiens (Human)
Description:
Residue:
488
  
Inhibitor
Name:
BDBM226060
Synonyms:
GTC000047A
Type:
Small Organic Molecule
Emp. Form.:
C21H30ClN3O7S2
Mol. Mass.:
536.062
SMILES:
CCOC(=O)CN([C@H]1CCN([C@@H](C)C(=O)N2CCOCC2)C1=O)S(=O)(=O)CCc1ccc(Cl)s1
: