Target
Fatty acid-binding protein 5
Ligand
BDBM22319
Substrate
Meas. Tech.
Ligand Binding Assay
pH
8.2±n/a
Temperature
303.15±n/a K
Ki
2.59e+3±n/a nM
Comments
extracted
Citation
 Armstrong, EHGoswami, DGriffin, PRNoy, NOrtlund, EA Structural basis for ligand regulation of the fatty acid-binding protein 5, peroxisome proliferator-activated receptor ß/d (FABP5-PPARß/d) signaling pathway. J Biol Chem 289:14941-54 (2014)  
Target
Name:
Fatty acid-binding protein 5
Synonyms:
FABP5 Fatty acid binding protein epidermal | Fatty acid-binding protein 5 (FABP5)
Type:
Enzyme
Mol. Mass.:
15164.79
Organism:
Homo sapiens (Human)
Description:
Q01469
Residue:
135
  
Inhibitor
Name:
BDBM22319
Synonyms:
(5Z,8Z,11Z,14Z)-icosa-5,8,11,14-tetraenoic acid Arachidonic acid (AA) [1-14C]Arachidonic acid
Type:
Unsaturated fatty acid
Emp. Form.:
C20H32O2
Mol. Mass.:
304.4669
SMILES:
CCCCC\C=C/C\C=C/C\C=C/C\C=C/CCCC(O)=O
: