Target
3-hydroxyacyl-CoA dehydrogenase type-2
Ligand
BDBM232930
Substrate
Meas. Tech.
ABAD Enzymatic Activity Assay
pH
7.3±n/a
Temperature
298.15±n/a K
Ki
9600±n/a nM
IC50
34100±n/a nM
Kd
380±n/a nM
Comments
extracted
Citation
 Yan, SValasani, KR Phosphonate derivatives and methods of use thereof in the treatment of Alzheimer's disease US Patent  US9346839 Publication Date 5/24/2016 
Target
Name:
3-hydroxyacyl-CoA dehydrogenase type-2
Synonyms:
Amyloid Binding Alcohol Dehydrogenase HADH2 HSD17B10 SCHAD XH98G2
Type:
Enyzme
Mol. Mass.:
26924.79
Organism:
Homo sapiens (Human)
Description:
Q99714
Residue:
261
  
Inhibitor
Name:
BDBM232930
Synonyms:
US9346839, 11 | US9738668, Compound 11
Type:
Small organic molecule
Emp. Form.:
C15H18N3O4PS
Mol. Mass.:
367.36
SMILES:
COc1ccc2nc(N[C@@H](c3ccc[nH]3)P(=O)(OC)OC)sc2c1
: