Target
Angiopoietin-1 receptor [776-1124]
Ligand
BDBM239548
Substrate
Meas. Tech.
Time-Resolved Fluorescence Resonance Energy Transfer (TR-FRET) Assay
pH
7±n/a
Temperature
295.15±n/a K
IC50
0.3±n/a nM
Comments
extracted
Citation
 Süβmeier, FLobell, MGrünewald, SHärter, MBuchmann, BTelser, JJöriβen, HHeroult, MKahnert, ALustig, KLindner, N Substituted phenylimidazopyrazoles and their use US Patent  US9394309 Publication Date 7/19/2016 
Target
Name:
Angiopoietin-1 receptor [776-1124]
Synonyms:
TEK TIE2_HUMAN VMCM | VMCM1
Type:
Enzyme
Mol. Mass.:
39865.58
Organism:
Homo sapiens (Human)
Description:
amino acids 776-1124
Residue:
349
  
Inhibitor
Name:
BDBM239548
Synonyms:
US9394309, 1
Type:
Small organic molecule
Emp. Form.:
C26H25F5N8OS
Mol. Mass.:
592.587
SMILES:
Cc1ccc(NC(=O)c2cc(cc(c2)S(F)(F)(F)(F)F)N2CCNCC2)cc1-n1ccn2nc(cc12)-c1cn[nH]c1
: