Target
Tyrosine-protein kinase JAK1
Ligand
BDBM100350
Substrate
Meas. Tech.
Kinase Assay
Kd
4.70±n/a nM
Citation
 Bauer, SMJia, ZJMehrotra, MSong, YXu, QHuang, WVenkataramani, CRose, JWPandey, A Inhibitors of protein kinases US Patent  US10533001 Publication Date 1/14/2020 
Target
Name:
Tyrosine-protein kinase JAK1
Synonyms:
JAK-1 JAK1A JAK1_HUMAN Janus kinase 1 (JAK1) | Janus kinase 1 JAK1
Type:
Protein
Mol. Mass.:
133293.73
Organism:
Homo sapiens (Human)
Description:
P23458
Residue:
1154
  
Inhibitor
Name:
BDBM100350
Synonyms:
US10533001, Example 99 US8501944, 372 US9868729, Example 99
Type:
Small organic molecule
Emp. Form.:
C19H25N7O3S
Mol. Mass.:
431.512
SMILES:
CS(=O)(=O)N1CCN(CC1)c1ccc(Nc2ncc(C(N)=O)c(NC3CC3)n2)cc1
: