Target
Dimer of Gag-Pol polyprotein [489-587]
Ligand
BDBM7020
Substrate
Fluorescent peptide substrate
Meas. Tech.
Protease Inhibition Assay
pH
5.5±n/a
Temperature
310.15±n/a K
Ki
0.04±n/a nM
Citation
 Nugiel, DAJacobs, KCornelius, LChang, CHJadhav, PKHoller, ERKlabe, RMBacheler, LTCordova, BGarber, SReid, CLogue, KAGorey-Feret, LJLam, GNErickson-Viitanen, SSeitz, SP Improved P1/P1' substituents for cyclic urea based HIV-1 protease inhibitors: synthesis, structure-activity relationship, and X-ray crystal structure analysis. J Med Chem 40:1465-74 (1997)  
Target
Name:
Dimer of Gag-Pol polyprotein [489-587]
Synonyms:
HIV-1 Protease
Type:
Protein Complex
Mol. Mass.:
Description:
Components:
This complex has 2 components.
Component 1
Name:
Gag-Pol polyprotein [489-587]
Synonyms:
HIV protease HIV-1 Protease chain A POL_HV1N5 | gag-pol
Type:
Enzyme Subunit
Mol. Mass.:
10822.21
Organism:
Human immunodeficiency virus type 1
Description:
P12497[489-587]
Residue:
99
  
Component 2
Name:
Gag-Pol polyprotein [489-587]
Synonyms:
HIV protease HIV-1 Protease chain A POL_HV1N5 | gag-pol
Type:
Enzyme Subunit
Mol. Mass.:
10822.21
Organism:
Human immunodeficiency virus type 1
Description:
P12497[489-587]
Residue:
99
  
Inhibitor
Name:
BDBM7020
Synonyms:
(4R,5S,6S,7R)-1,3-bis[(3-aminophenyl)methyl]-4,7-bis(2,3-dihydro-1,4-benzodioxin-6-ylmethyl)-5,6-dihydroxy-1,3-diazepan-2-one Cyclic Urea Based HIV-1 Protease Inhibitor 15
Type:
Small organic molecule
Emp. Form.:
C37H40N4O7
Mol. Mass.:
652.7361
SMILES:
Nc1cccc(CN2[C@H](Cc3ccc4OCCOc4c3)[C@H](O)[C@@H](O)[C@@H](Cc3ccc4OCCOc4c3)N(Cc3cccc(N)c3)C2=O)c1
:
Substrate
Name:
Fluorescent peptide substrate
Synonyms:
Type:
Peptide
Mol. Mass.:
4608.75
Organism:
Description:
Residue:
42