Target
Bcl-2-like protein 11 [51-76]/Induced myeloid leukemia cell differentiation protein Mcl-1 [171-327]
Ligand
BDBM449679
Substrate
Meas. Tech.
Binding AlphaLISA Assay
IC50
0.020±n/a nM
Citation
Target
Name:
Bcl-2-like protein 11 [51-76]/Induced myeloid leukemia cell differentiation protein Mcl-1 [171-327]
Synonyms:
Bcl-2-like protein 11 [51-76]/Induced myeloid leukemia cell differentiation protein Mcl-1 [171-327] Mcl-1 and BIM | Mcl-1/BIM
Type:
Protein
Mol. Mass.:
Description:
Components:
This complex has 2 components.
Component 1
Name:
Induced myeloid leukemia cell differentiation protein Mcl-1 [171-327]
Synonyms:
BCL2L3 MCL1 Myeloid cell leukemia 1 (Mcl-1)
Type:
Enzyme Catalytic Domain
Mol. Mass.:
17896.13
Organism:
Homo sapiens (Human)
Description:
Q07820[171-327]
Residue:
157
  
Component 2
Name:
Bcl-2-like protein 11 [51-76]
Synonyms:
B2L11_HUMAN BIM Bcl-2-like protein 11 (BIM) (51-76)
Type:
Enzyme Catalytic Domain
Mol. Mass.:
2530.22
Organism:
Homo sapiens (Human)
Description:
O43521[51-76]
Residue:
26
  
Inhibitor
Name:
BDBM449679
Synonyms:
US10703733, Example 292 | US11643400, Example 292
Type:
Small organic molecule
Emp. Form.:
C39H50ClN5O7S
Mol. Mass.:
768.362
SMILES:
CO[C@H]1\C=C\C[C@H](C)C[S@@](=O)(NC(=O)N2CC(C2)OC(=O)N(C)C)=NC(=O)c2ccc3OC[C@]4(CCCc5cc(Cl)ccc45)CN(C[C@@H]4CC[C@@H]14)c3c2
: