Target
Glutamate carboxypeptidase 2
Ligand
BDBM456926
Substrate
Meas. Tech.
Fluorescence-Based Amplex Red Glutamic Acid Assay
Ki
1.10±n/a nM
Citation
 Pomper, MGMease, RCRay, SChen, YYang, X Scaffolds and multifunctional intermediates for imaging PSMA and cancer therapy US Patent  US10736974 Publication Date 8/11/2020 
Target
Name:
Glutamate carboxypeptidase 2
Synonyms:
FGCP FOLH1 Folate hydrolase 1 Glutamate carboxypeptidase 2 Membrane glutamate carboxypeptidase NAALAD1 PSM Prostate-specific membrane antigen mGCP
Type:
PROTEIN
Mol. Mass.:
84333.66
Organism:
Homo sapiens (Human)
Description:
ChEMBL_1497035
Residue:
750
  
Inhibitor
Name:
BDBM456926
Synonyms:
US10736974, Compound DCFPyL
Type:
Small organic molecule
Emp. Form.:
C17H23FN4O6
Mol. Mass.:
398.3861
SMILES:
OC(=O)CC[C@H](NC(=O)NCCCCCNC(=O)c1ccc(F)nc1)C(O)=O
: