Target
Glutamate carboxypeptidase 2
Ligand
BDBM456929
Substrate
Meas. Tech.
Fluorescence-Based Amplex Red Glutamic Acid Assay
Ki
0.100±n/a nM
Citation
 Pomper, MGMease, RCRay, SChen, YYang, X Scaffolds and multifunctional intermediates for imaging PSMA and cancer therapy US Patent  US10736974 Publication Date 8/11/2020 
Target
Name:
Glutamate carboxypeptidase 2
Synonyms:
FGCP FOLH1 Folate hydrolase 1 Glutamate carboxypeptidase 2 Membrane glutamate carboxypeptidase NAALAD1 PSM Prostate-specific membrane antigen mGCP
Type:
PROTEIN
Mol. Mass.:
84333.66
Organism:
Homo sapiens (Human)
Description:
ChEMBL_1497035
Residue:
750
  
Inhibitor
Name:
BDBM456929
Synonyms:
US10736974, Compound XY-45
Type:
Small organic molecule
Emp. Form.:
C26H33FN4O9
Mol. Mass.:
564.56
SMILES:
OC(=O)CC[C@H](NC(=O)NC[C@@H](NC(=O)CCCNC(=O)c1ccc(cc1F)C1=CCCCC1)OC=O)C(O)=O
: