Target
Glutamate carboxypeptidase 2
Ligand
BDBM456906
Substrate
Meas. Tech.
Fluorescence-Based Amplex Red Glutamic Acid Assay
Ki
0.900±n/a nM
Citation
 Pomper, MGMease, RCRay, SChen, YYang, X Scaffolds and multifunctional intermediates for imaging PSMA and cancer therapy US Patent  US10736974 Publication Date 8/11/2020 
Target
Name:
Glutamate carboxypeptidase 2
Synonyms:
FGCP FOLH1 Folate hydrolase 1 Glutamate carboxypeptidase 2 Membrane glutamate carboxypeptidase NAALAD1 PSM Prostate-specific membrane antigen mGCP
Type:
PROTEIN
Mol. Mass.:
84333.66
Organism:
Homo sapiens (Human)
Description:
ChEMBL_1497035
Residue:
750
  
Inhibitor
Name:
BDBM456906
Synonyms:
US10736974, Compound XY-26 | US10736974, Entry 9
Type:
Small organic molecule
Emp. Form.:
C19H23IN2O9
Mol. Mass.:
550.2984
SMILES:
OC(=O)CC[C@H](NC(=O)O[C@@H](CCCCNC(=O)c1ccc(I)cc1)OC=O)C(O)=O
: