Target
Retinoic acid receptor beta
Ligand
BDBM323588
Substrate
Meas. Tech.
Transactivation assays
EC50
1.88±n/a nM
Citation
 Borthwick, ADMills, MTBrown, JTCorcoran, JPDe Castro Vasconcelos Goncalves, MBKalindjian, SB Bicycloheteroaryl-heteroaryl-benzoic acid compounds as retinoic acid receptor beta (RARβ) agonists US Patent  US10752616 Publication Date 8/25/2020 
Target
Name:
Retinoic acid receptor beta
Synonyms:
HAP NR1B2 RAR-beta RARB Retinoic acid receptor RXR-alpha/Retinoic acid receptor beta Retinoid receptor
Type:
PROTEIN
Mol. Mass.:
50498.70
Organism:
Homo sapiens (Human)
Description:
ChEMBL_1458015
Residue:
455
  
Inhibitor
Name:
BDBM323588
Synonyms:
Retinoic Acid US10752616, Code No. atRA at-RA
Type:
Small organic molecule
Emp. Form.:
C20H28O2
Mol. Mass.:
300.4351
SMILES:
CC(C=CC1=C(C)CCCC1(C)C)=CC=CC(C)=CC(O)=O
: