Target
Tyrosine-protein kinase JAK1 [850-1154]
Ligand
BDBM458939
Substrate
Meas. Tech.
In Vitro JAK kinase Assays
IC50
2.00±n/a nM
Citation
 Esteve Trias, CTaltavull Moll, JGonzalez Rodriguez, JVidal Juan, B 2-(pyrazolopyridin-3-yl)pyrimidine derivatives as JAK inhibitors US Patent  US10759793 Publication Date 9/1/2020 
Target
Name:
Tyrosine-protein kinase JAK1 [850-1154]
Synonyms:
JAK1 JAK1B Tyrosine-protein kinase JAK1 (850-1154)
Type:
Enzyme Catalytic Domain
Mol. Mass.:
34949.64
Organism:
Description:
aa 850-1154
Residue:
305
 
Inhibitor
Name:
BDBM458939
Synonyms:
US10759793, Example 84
Type:
Small organic molecule
Emp. Form.:
C24H24FN7O3
Mol. Mass.:
477.4909
SMILES:
OCC(=O)N1CCC[C@H](C1)Nc1nc(nc(c1F)-c1ccc(CO)nc1)-c1cnn2ccccc12
: