Target
Tyrosine-protein kinase JAK1 [850-1154]
Ligand
BDBM458954
Substrate
Meas. Tech.
In Vitro JAK kinase Assays
IC50
3.00±n/a nM
Citation
 Esteve Trias, CTaltavull Moll, JGonzalez Rodriguez, JVidal Juan, B 2-(pyrazolopyridin-3-yl)pyrimidine derivatives as JAK inhibitors US Patent  US10759793 Publication Date 9/1/2020 
Target
Name:
Tyrosine-protein kinase JAK1 [850-1154]
Synonyms:
JAK1 JAK1B Tyrosine-protein kinase JAK1 (850-1154)
Type:
Enzyme Catalytic Domain
Mol. Mass.:
34949.64
Organism:
Description:
aa 850-1154
Residue:
305
 
Inhibitor
Name:
BDBM458954
Synonyms:
US10759793, Example 98
Type:
Small organic molecule
Emp. Form.:
C24H25N7O3
Mol. Mass.:
459.5004
SMILES:
COc1cc(ccn1)-c1cc(N[C@@H]2CCCN(C2)C(=O)CO)nc(n1)-c1cnn2ccccc12
: