Target
Tyrosine-protein kinase receptor UFO
Ligand
BDBM299803
Substrate
Meas. Tech.
Enzyme Assay
Ki
0.030±n/a nM
Citation
 Johnson, TWRichardson, PFCollins, MRRichter, DTBurke, BJNinkovic, SGajiwala, KSLinton, MALe, PTHoffman, JE Axl inhibitors US Patent  US9593097 Publication Date 3/14/2017 
Target
Name:
Tyrosine-protein kinase receptor UFO
Synonyms:
AXL TEL/AXL UFO | UFO_HUMAN
Type:
Enzyme
Mol. Mass.:
98316.97
Organism:
Homo sapiens (Human)
Description:
P30530
Residue:
894
  
Inhibitor
Name:
BDBM299803
Synonyms:
N- (bicyclo[1.1.1]pent- 1-yl)-4-{[(1S,2R)- 2- cyanocyclopropyl] methoxy}-6-[4-(4- methoxy-1H- pyrazolo[3,4- b]pyridin-3- yl)piperidin-1-yl]- 1,3,5-triazine-2- carboxamide | US9593097, Example 173
Type:
Small organic molecule
Emp. Form.:
C26H29N9O3
Mol. Mass.:
515.567
SMILES:
COc1ccnc2[nH]nc(C3CCN(CC3)c3nc(OC[C@H]4C[C@H]4C#N)nc(n3)C(=O)NC34CC(C3)C4)c12
: