Target
Tyrosine-protein kinase receptor UFO
Ligand
BDBM299851
Substrate
Meas. Tech.
Enzyme Assay
Ki
0.042±n/a nM
Citation
 Johnson, TWRichardson, PFCollins, MRRichter, DTBurke, BJNinkovic, SGajiwala, KSLinton, MALe, PTHoffman, JE Axl inhibitors US Patent  US9593097 Publication Date 3/14/2017 
Target
Name:
Tyrosine-protein kinase receptor UFO
Synonyms:
AXL TEL/AXL UFO | UFO_HUMAN
Type:
Enzyme
Mol. Mass.:
98316.97
Organism:
Homo sapiens (Human)
Description:
P30530
Residue:
894
  
Inhibitor
Name:
BDBM299851
Synonyms:
4-[4-({[2-amino-5- (1-methyl-1H- imidazol-4- yl)pyridin-3- yl]oxy}methyl) piperidin-1- yl]-6-[(1- cyanocyclopropyl) methoxy]-N- (propan-2-yl)- 1,3,5-triazine-2- carboxamide | US9593097, Example 221
Type:
Small organic molecule
Emp. Form.:
C27H34N10O3
Mol. Mass.:
546.6241
SMILES:
CC(C)NC(=O)c1nc(OCC2(CC2)C#N)nc(n1)N1CCC(COc2cc(cnc2N)-c2cn(C)cn2)CC1
: