Target
Cannabinoid receptor 2
Ligand
BDBM474533
Substrate
Meas. Tech.
Binding Assay
Ki
0.600±n/a nM
Citation
 Makriyannis, AThakur, GASharma, R Cannabinergic compounds and uses thereof US Patent  US10882838 Publication Date 1/5/2021 
Target
Name:
Cannabinoid receptor 2
Synonyms:
CANNABINOID CB2 CB2 CB2B CNR2_HUMAN Cannabinoid CB2 receptor Cannabinoid receptor 2 (CB2R) | hCB2
Type:
G Protein-Coupled Receptor (GPCR)
Mol. Mass.:
39690.94
Organism:
Homo sapiens (Human)
Description:
P34972
Residue:
360
  
Inhibitor
Name:
BDBM474533
Synonyms:
US10882838, Example 1.5
Type:
Small organic molecule
Emp. Form.:
C25H35BrO4
Mol. Mass.:
479.447
SMILES:
CC1=CC[C@H]2[C@@H](C1)c1c(O)cc(cc1OC2(C)C)C(C)(C)C(=O)OCCCCCBr
: