Target
Tyrosine-protein kinase JAK1
Ligand
BDBM489971
Substrate
Meas. Tech.
Caliper Enzyme Assay
IC50
0.008±n/a nM
Citation
 Vazquez, MLKaila, NTuttle, JBVerhoest, PRReese, MRCoffman, KJSamad, TDuerr, JMSciabola, SParikh, MD Pyrrolo[2,3-d]pyrimidine derivatives US Patent  US10966980 Publication Date 4/6/2021 
Target
Name:
Tyrosine-protein kinase JAK1
Synonyms:
JAK-1 JAK1A JAK1_HUMAN Janus kinase 1 (JAK1) | Janus kinase 1 JAK1
Type:
Protein
Mol. Mass.:
133293.73
Organism:
Homo sapiens (Human)
Description:
P23458
Residue:
1154
  
Inhibitor
Name:
BDBM489971
Synonyms:
US10966980, Example 225
Type:
Small organic molecule
Emp. Form.:
C19H23N5O3S
Mol. Mass.:
401.483
SMILES:
CCOc1ncccc1S(=O)(=O)C[C@H]1C[C@H](C1)N(C)c1ncnc2[nH]ccc12
: