Target
Tyrosine-protein kinase JAK1
Ligand
BDBM490003
Substrate
Meas. Tech.
Caliper Enzyme Assay
IC50
0.009±n/a nM
Citation
 Vazquez, MLKaila, NTuttle, JBVerhoest, PRReese, MRCoffman, KJSamad, TDuerr, JMSciabola, SParikh, MD Pyrrolo[2,3-d]pyrimidine derivatives US Patent  US10966980 Publication Date 4/6/2021 
Target
Name:
Tyrosine-protein kinase JAK1
Synonyms:
JAK-1 JAK1A JAK1_HUMAN Janus kinase 1 (JAK1) | Janus kinase 1 JAK1
Type:
Protein
Mol. Mass.:
133293.73
Organism:
Homo sapiens (Human)
Description:
P23458
Residue:
1154
  
Inhibitor
Name:
BDBM490003
Synonyms:
US10966980, Example 257
Type:
Small organic molecule
Emp. Form.:
C21H29N7O2S
Mol. Mass.:
443.566
SMILES:
CN([C@@H]1C[C@H](CS(=O)(=O)N2Cc3cn(C)nc3C(C)(C)C2)C1)c1ncnc2[nH]ccc12
: