Target
Induced myeloid leukemia cell differentiation protein Mcl-1 [171-327]
Ligand
BDBM449547
Substrate
Meas. Tech.
AlphaLISA Assay
IC50
0.031±n/a nM
Citation
Target
Name:
Induced myeloid leukemia cell differentiation protein Mcl-1 [171-327]
Synonyms:
BCL2L3 MCL1 Myeloid cell leukemia 1 (Mcl-1)
Type:
Enzyme Catalytic Domain
Mol. Mass.:
17896.13
Organism:
Homo sapiens (Human)
Description:
Q07820[171-327]
Residue:
157
  
Inhibitor
Name:
BDBM449547
Synonyms:
US10703733, Example 160 US10988451, Example 195 | US11643400, Example 195
Type:
Small organic molecule
Emp. Form.:
C37H47ClN4O6S
Mol. Mass.:
711.31
SMILES:
CO[C@H]1C[C@@H]1NC(=O)N[S@@]1(=O)=NC(=O)c2ccc3OC[C@]4(CCCc5cc(Cl)ccc45)CN(C[C@@H]4CC[C@H]4[C@@H](OC)\C=C\C[C@H](C)C1)c3c2
: