Target
Induced myeloid leukemia cell differentiation protein Mcl-1 [171-327]
Ligand
BDBM493759
Substrate
Meas. Tech.
AlphaLISA Assay
IC50
0.030±n/a nM
Citation
Target
Name:
Induced myeloid leukemia cell differentiation protein Mcl-1 [171-327]
Synonyms:
BCL2L3 MCL1 Myeloid cell leukemia 1 (Mcl-1)
Type:
Enzyme Catalytic Domain
Mol. Mass.:
17896.13
Organism:
Homo sapiens (Human)
Description:
Q07820[171-327]
Residue:
157
  
Inhibitor
Name:
BDBM493759
Synonyms:
US10988451, Example 229 | US11643400, Example 229
Type:
Small organic molecule
Emp. Form.:
C48H61ClN6O7S
Mol. Mass.:
901.552
SMILES:
C[C@H]1C\C=C\[C@H](O)[C@@H]2CC[C@H]2CN2C[C@@]3(CCCc4cc(Cl)ccc34)COc3ccc(cc23)C(=O)N=[S@](=O)(NC(=O)c2cc3CO[C@@H](CN4CCN5CCOC[C@H]5C4)Cn3c2)[C@@H]1C
: