Target
Glycogen synthase kinase-3 beta
Ligand
BDBM498334
Substrate
Meas. Tech.
Biochemical Assay
Ki
1.72±n/a nM
Citation
 Behenna, DCFreeman-Cook, KDHoffman, RLNagata, ANinkovic, SSutton, SC CDK2 inhibitors US Patent  US11014911 Publication Date 5/25/2021 
Target
Name:
Glycogen synthase kinase-3 beta
Synonyms:
GSK-3 beta GSK3B Glycogen synthase kinase 3 beta (GSK3B) Glycogen synthase kinase-3 beta (GSK-3B) Glycogen synthase kinase-3 beta (GSK3B) Glycogen synthase kinase-3beta (GSK3B) | Serine/threonine-protein kinase GSK3B
Type:
Enzyme
Mol. Mass.:
46756.38
Organism:
Homo sapiens (Human)
Description:
P49841
Residue:
420
  
Inhibitor
Name:
BDBM498334
Synonyms:
US11014911, Example 159 US11718603, Example 160
Type:
Small organic molecule
Emp. Form.:
C20H24N6O3S
Mol. Mass.:
428.508
SMILES:
C[C@H]1[C@@H](CN1C(=O)O[C@@H]1CC[C@@H](C1)c1cc(NC(=O)Cc2cnc(C)s2)n[nH]1)C#N
: