Target
Glutaminyl-peptide cyclotransferase
Ligand
BDBM7953
Substrate
BDBM7883
Meas. Tech.
QC Inhibition Testing
Ki
4400000±n/a nM
Citation
 Schilling, SNiestroj, AJRahfeld, JUHoffmann, TWermann, MZunkel, KWasternack, CDemuth, HU Identification of human glutaminyl cyclase as a metalloenzyme. Potent inhibition by imidazole derivatives and heterocyclic chelators. J Biol Chem 278:49773-9 (2003)  
Target
Name:
Glutaminyl-peptide cyclotransferase
Synonyms:
Glutaminyl Cyclase Glutaminyl-peptide cyclotransferase Glutaminyl-tRNA cyclotransferase QPCT | QPCT_HUMAN
Type:
Enzyme
Mol. Mass.:
40877.05
Organism:
Homo sapiens (Human)
Description:
Q16769
Residue:
361
  
Inhibitor
Name:
BDBM7953
Synonyms:
(2S)-2-amino-3-(1H-imidazol-4-yl)propanoic acid Imidazole C-4(5) deriv. 5 L-Histidine
Type:
Small organic molecule
Emp. Form.:
C6H9N3O2
Mol. Mass.:
155.1546
SMILES:
N[C@@H](Cc1cnc[nH]1)C(O)=O
:
Substrate
Name:
BDBM7883
Synonyms:
(2S)-2-amino-N-(4-methyl-2-oxo-2H-chromen-7-yl)pentanediamide L-glutaminyl-4-methylcoumarinylamide
Type:
Small organic molecule
Emp. Form.:
C15H17N3O4
Mol. Mass.:
303.3132
SMILES:
Cc1cc(=O)oc2cc(NC(=O)[C@@H](N)CCC(N)=O)ccc12
: