BDBM21785 2-[(1S)-5-(3-{4-[5-(trifluoromethyl)pyridin-2-yl]phenoxy}propoxy)-2,3-dihydro-1H-inden-1-yl]acetic acid::Indanylacetic Acid Analog, 29i
SMILES OC(=O)C[C@@H]1CCc2cc(OCCCOc3ccc(cc3)-c3ccc(cn3)C(F)(F)F)ccc12
InChI Key InChIKey=FRMOQCTZEMXUFQ-IBGZPJMESA-N
Data  5 EC50
  Tab Delimited (TSV)   2D SDfile   Computed 3D by Vconf -m prep SDfile
Find this compound or compounds like it in BindingDB:
Activity Spreadsheet -- Enzyme Inhibition Constant Data from BindingDB
Found 5 hits for monomerid = 21785
TargetPeroxisome proliferator-activated receptor alpha(Homo sapiens (Human))
Bayer Healthcare Pharmaceuticals
LigandPNGBDBM21785(2-[(1S)-5-(3-{4-[5-(trifluoromethyl)pyridin-2-yl]p...)
Affinity DataEC50:  2.90E+3nMT: 2°C. Assay description: Activity was assessed by measuring the human PPAR ligand binding domain with the co-activator protein. Europium labeled anti-GST antibody, streptavid...
In DepthDetails ArticlePubMed
TargetPeroxisome proliferator-activated receptor delta(Homo sapiens (Human))
Bayer Healthcare Pharmaceuticals
LigandPNGBDBM21785(2-[(1S)-5-(3-{4-[5-(trifluoromethyl)pyridin-2-yl]p...)
Affinity DataEC50:  0.950nMT: 2°C. Assay description: Activity was assessed by measuring the human PPAR ligand binding domain with the co-activator protein. Europium labeled anti-GST antibody, streptavid...
In DepthDetails ArticlePubMed
LigandPNGBDBM21785(2-[(1S)-5-(3-{4-[5-(trifluoromethyl)pyridin-2-yl]p...)
Affinity DataEC50:  5.62E+5nM. Assay description: Agonist activity at Homo sapiens (human) PPARgamma expressed in mouse 3T3-L1 cells incubated for 2 days followed by compound wash out measured after ...
In DepthDetails Article
TargetPeroxisome proliferator-activated receptor alpha(Homo sapiens (Human))
Bayer Healthcare Pharmaceuticals
LigandPNGBDBM21785(2-[(1S)-5-(3-{4-[5-(trifluoromethyl)pyridin-2-yl]p...)
Affinity DataEC50:  3.45E+5nM. Assay description: Agonist activity at GST-tagged Homo sapiens (human) PPARalpha ligand binding domain after 2 hr by FRET assay
In DepthDetails Article
LigandPNGBDBM21785(2-[(1S)-5-(3-{4-[5-(trifluoromethyl)pyridin-2-yl]p...)
Affinity DataEC50:  1.80E+3nMT: 2°C. Assay description: PPAR gamma activity was assessed by using the IRBA in mouse 3T3-L1 cells. This assay measures the ability of test compound to cause an increase in th...
In DepthDetails ArticlePubMed