BDBM242409 US9416132, 8-64
SMILES CO[C@H]1CC[C@@H](CC1)Nc1ccn2ncc(-c3cccc(Cl)c3)c2n1
InChI Key InChIKey=FBQBEGGSOHQPPV-WKILWMFISA-N
Data  2 IC50
  Tab Delimited (TSV)   2D SDfile   Computed 3D by Vconf -m prep SDfile
Find this compound or compounds like it in BindingDB:
Activity Spreadsheet -- Enzyme Inhibition Constant Data from BindingDB
Found 2 hits for monomerid = 242409
TargetPotassium voltage-gated channel subfamily H member 2(Homo sapiens (Human))
Tolero Pharmaceuticals
US Patent
LigandPNGBDBM242409(US9416132, 8-64)
Affinity DataIC50: >3.00E+4nM. Assay description: Representative compounds were tested for hERG activity using the Fast Patch assay available from WuXiApptec (Shanghai China).
Ligand InfoPC cidPC sid
In DepthDetails US Patent
TargetSerine/threonine-protein kinase pim-1(Homo sapiens (Human))
Tolero Pharmaceuticals
US Patent
LigandPNGBDBM242409(US9416132, 8-64)
Affinity DataIC50:  68nMT: 2°C. Assay description: These assays are set up in duplicate 50 ul volumes in white, flat bottom 96 well plates. Inhibitors are added to the solution of 1× kinase buff...
Ligand InfoPC cidPC sid
In DepthDetails US Patent