BDBM29057 cambinol analog, 6f
SMILES CCn1c(-c2ccccc2)c(Cc2c(O)ccc3ccccc23)c(=O)[nH]c1=S
InChI Key InChIKey=STOIOCJTMHXRIR-UHFFFAOYSA-N
Data  1 IC50  1 Other
  Tab Delimited (TSV)   2D SDfile   Computed 3D by Vconf -m prep SDfile
Find this compound or compounds like it in BindingDB:
Activity Spreadsheet -- Enzyme Inhibition Constant Data from BindingDB
Found 2 hits for monomerid = 29057
TargetNAD-dependent protein deacetylase sirtuin-2(Homo sapiens (Human))
University Of St. Andrews
LigandPNGBDBM29057(cambinol analog, 6f)
Affinity DataIC50:  1.05E+4nM. Assay description: Compounds were tested for inhibition of sirtuin (SIRT1 or SIRT2) using the human recombinant enzyme provided with the Fluor de Lys fluorescence-based...
In DepthDetails ArticlePubMed
TargetNAD-dependent protein deacetylase sirtuin-1(Homo sapiens (Human))
University Of St. Andrews
LigandPNGBDBM29057(cambinol analog, 6f)
Affinity DatapH: 8.0 T: 2°C. Assay description: Compounds were tested for inhibition of sirtuin (SIRT1 or SIRT2) using the human recombinant enzyme provided with the Fluor de Lys fluorescence-based...
In DepthDetails ArticlePubMed