BDBM29522 Pyranonaphthoquinone (PNQ) lactone, 11l
SMILES Nc1ccc(cc1)[C@@H]1O[C@@H]2CC(=O)O[C@@H]2C2=C1C(=O)c1ccccc1C2=O
InChI Key InChIKey=IHBRLMBTNSCUNU-OREJSRFESA-N
Data  1 IC50
  Tab Delimited (TSV)   2D SDfile   Computed 3D by Vconf -m prep SDfile
Find this compound or compounds like it in BindingDB:
Activity Spreadsheet -- Enzyme Inhibition Constant Data from BindingDB
Found 1 hit for monomerid = 29522
TargetRAC-alpha serine/threonine-protein kinase(Homo sapiens (Human))
Wyeth Research
LigandPNGBDBM29522(Pyranonaphthoquinone (PNQ) lactone, 11l)
Affinity DataIC50:  850nMpH: 7.4 T: 2°C. Assay description: AKT1 was assayed using constitutively active Myr-AKT1 in low-binding 96-well plates. The kinase reactions were initiated by the addition of assay mix...
In DepthDetails ArticlePubMed