BDBM30056 triazolothiadiazine, 5H
SMILES COc1cc(OC)cc(c1)-c1nnc2SCC(=Nn12)c1ccc(OC)c(OC)c1
InChI Key InChIKey=BOUFTPYNPZYZKD-UHFFFAOYSA-N
Data  1 IC50
  Tab Delimited (TSV)   2D SDfile   Computed 3D by Vconf -m prep SDfile
Find this compound or compounds like it in BindingDB:
Activity Spreadsheet -- Enzyme Inhibition Constant Data from BindingDB
Found 1 hit for monomerid = 30056
LigandPNGBDBM30056(triazolothiadiazine, 5H)
Affinity DataIC50:  50nMpH: 7.2 T: 2°C. Assay description: Inhibition of PDE4A was performed using IMAP technology (Molecular Devices, CA). PDE4A1A mixture was dispensed into 1536-well black/solid bottom assa...
In DepthDetails ArticlePubMed