BDBM324709 3-{5-Chloro-2-[(2'- oxospiro[cyclopropane-1,3'- pyrrolo[2,3-c]pyridin]-1'(2'H)- yl)methyl]-1H-indol-1-yl}-N- (cyclopropylsulfonyl)propanamide::US10189838, Example 19-1
SMILES Clc1ccc2n(CCC(=O)NS(=O)(=O)C3CC3)c(CN3C(=O)C4(CC4)c4ccncc34)cc2c1
InChI Key InChIKey=XYJPCHYRRQJQPJ-UHFFFAOYSA-N
Data  1 EC50
  Tab Delimited (TSV)   2D SDfile   Computed 3D by Vconf -m prep SDfile
Find this compound or compounds like it in BindingDB:
Activity Spreadsheet -- Enzyme Inhibition Constant Data from BindingDB
Found 1 hit for monomerid = 324709
TargetProtein M2-1(Human respiratory syncytial virus A (strain A2))
Hoffmann-La Roche
US Patent
LigandPNGBDBM324709(3-{5-Chloro-2-[(2'- oxospiro[cyclopropane-1,3'- py...)
Affinity DataEC50:  1.18E+3nM. Assay description: To measure anti-RSV activity of compounds, 96-well plates are seeded with 6×103 cells per well in Dulbecco's modified Eagle's medium (DMEM) c...
Ligand InfoPC cidPC sid
In DepthDetails US Patent