BDBM37221 1-[4-[4-[5-(trifluoromethyl)-2-pyridinyl]-1-piperazinyl]phenyl]ethanone::1-[4-[4-[5-(trifluoromethyl)-2-pyridyl]piperazino]phenyl]ethanone::1-[4-[4-[5-(trifluoromethyl)pyridin-2-yl]piperazin-1-yl]phenyl]ethanone::MLS000108524::SMR000104479::cid_869896
SMILES CC(=O)c1ccc(cc1)N1CCN(CC1)c1ccc(cn1)C(F)(F)F
InChI Key InChIKey=MSJLDKXCDPRWEB-UHFFFAOYSA-N
Data  7 IC50  4 EC50
  Tab Delimited (TSV)   2D SDfile   Computed 3D by Vconf -m prep SDfile
Find this compound or compounds like it in BindingDB:
Activity Spreadsheet -- Enzyme Inhibition Constant Data from BindingDB
Found 11 hits for monomerid = 37221
TargetSphingosine 1-phosphate receptor 1(Homo sapiens (Human))
The Scripps Research Institute Molecular Screening Center
Curated by PubChem BioAssay
LigandPNGBDBM37221(1-[4-[4-[5-(trifluoromethyl)-2-pyridinyl]-1-pipera...)
Affinity DataEC50:  3.70E+4nM. Assay description: Source (MLSCN Center Name): The Scripps Research Institute Molecular Screening Center Center Affiliation: The Scripps Research Institute, TSRI Assay ...
In DepthDetails PCBioAssay
TargetSphingosine 1-phosphate receptor 1(Homo sapiens (Human))
The Scripps Research Institute Molecular Screening Center
Curated by PubChem BioAssay
LigandPNGBDBM37221(1-[4-[4-[5-(trifluoromethyl)-2-pyridinyl]-1-pipera...)
Affinity DataEC50: >9.51E+4nM. Assay description: Source (MLSCN Center Name): The Scripps Research Institute Molecular Screening Center Center Affiliation: The Scripps Research Institute, TSRI Assay ...
In DepthDetails PCBioAssay
TargetSphingosine 1-phosphate receptor 1(Homo sapiens (Human))
The Scripps Research Institute Molecular Screening Center
Curated by PubChem BioAssay
LigandPNGBDBM37221(1-[4-[4-[5-(trifluoromethyl)-2-pyridinyl]-1-pipera...)
Affinity DataEC50:  2.94E+4nM. Assay description: Source (MLSCN Center Name): The Scripps Research Institute Molecular Screening Center Center Affiliation: The Scripps Research Institute, TSRI Assay ...
In DepthDetails PCBioAssay
TargetSphingosine 1-phosphate receptor 3(Homo sapiens (Human))
The Scripps Research Institute Molecular Screening Center
Curated by PubChem BioAssay
LigandPNGBDBM37221(1-[4-[4-[5-(trifluoromethyl)-2-pyridinyl]-1-pipera...)
Affinity DataIC50: >4.98E+4nM. Assay description: Source (MLSCN Center Name): The Scripps Research Institute Molecular Screening Center Center Affiliation: The Scripps Research Institute, TSRI Assay ...
In DepthDetails PCBioAssay
TargetSteroidogenic factor 1(Homo sapiens (Human))
The Scripps Research Institute Molecular Screening Center
Curated by PubChem BioAssay
LigandPNGBDBM37221(1-[4-[4-[5-(trifluoromethyl)-2-pyridinyl]-1-pipera...)
Affinity DataIC50: >3.30E+4nM. Assay description: Source (MLSCN Center Name): The Scripps Research Institute Molecular Screening Center Center Affiliation: The Scripps Research Institute, TSRI Assay ...
In DepthDetails PCBioAssay
TargetProtein Wnt-3a(Mus musculus)
Burnham Center For Chemical Genomics
Curated by PubChem BioAssay
LigandPNGBDBM37221(1-[4-[4-[5-(trifluoromethyl)-2-pyridinyl]-1-pipera...)
Affinity DataIC50:  2.43E+4nM
In DepthDetails PCBioAssay
TargetSteroidogenic factor 1(Homo sapiens (Human))
The Scripps Research Institute Molecular Screening Center
Curated by PubChem BioAssay
LigandPNGBDBM37221(1-[4-[4-[5-(trifluoromethyl)-2-pyridinyl]-1-pipera...)
Affinity DataIC50:  1.14E+4nM. Assay description: Source (MLSCN Center Name): The Scripps Research Institute Molecular Screening Center Center Affiliation: The Scripps Research Institute, TSRI Assay ...
In DepthDetails PCBioAssay
TargetIsoform 2 of Nuclear receptor ROR-alpha (Alpha-2)(Homo sapiens (Human))
The Scripps Research Institute Molecular Screening Center
Curated by PubChem BioAssay
LigandPNGBDBM37221(1-[4-[4-[5-(trifluoromethyl)-2-pyridinyl]-1-pipera...)
Affinity DataIC50:  2.43E+4nM. Assay description: Source (MLSCN Center Name): The Scripps Research Institute Molecular Screening Center Center Affiliation: The Scripps Research Institute, TSRI Assay ...
In DepthDetails PCBioAssay
TargetMultidrug resistance-associated protein 1(Homo sapiens (Human))
Srmlsc
Curated by PubChem BioAssay
LigandPNGBDBM37221(1-[4-[4-[5-(trifluoromethyl)-2-pyridinyl]-1-pipera...)
Affinity DataEC50:  3.00E+3nM. Assay description: Southern Research Molecular Libraries Screening Center (SRMLSC) Southern Research Institute (Birmingham, Alabama) NIH Molecular Libraries Screening C...
In DepthDetails PCBioAssay
TargetZinc finger protein GLI1(Mus musculus)
Burnham Center For Chemical Genomics
Curated by PubChem BioAssay
LigandPNGBDBM37221(1-[4-[4-[5-(trifluoromethyl)-2-pyridinyl]-1-pipera...)
Affinity DataIC50:  8.99E+3nM. Assay description: Data Source: Sanford-Burnham Center for Chemical Genomics (SBCCG) Source Affiliation: Sanford-Burnham Medical Research Institute (SBMRI, San Diego, C...
In DepthDetails PCBioAssay
TargetIsoform 2 of Nuclear receptor ROR-alpha (Alpha-2)(Homo sapiens (Human))
The Scripps Research Institute Molecular Screening Center
Curated by PubChem BioAssay
LigandPNGBDBM37221(1-[4-[4-[5-(trifluoromethyl)-2-pyridinyl]-1-pipera...)
Affinity DataIC50:  9.35E+3nM. Assay description: Source (MLSCN Center Name): The Scripps Research Institute Molecular Screening Center Center Affiliation: The Scripps Research Institute, TSRI Assay ...
In DepthDetails PCBioAssay