BDBM44702 2-O-cyclohexyl 5-O-methyl 3,6-dimethyl-4-oxo-1,5,6,7-tetrahydroindole-2,5-dicarboxylate::3,6-dimethyl-4-oxo-1,5,6,7-tetrahydroindole-2,5-dicarboxylic acid O2-cyclohexyl ester O5-methyl ester::4-keto-3,6-dimethyl-1,5,6,7-tetrahydroindole-2,5-dicarboxylic acid O2-cyclohexyl ester O5-methyl ester::MLS000116516::O2-cyclohexyl O5-methyl 3,6-dimethyl-4-oxidanylidene-1,5,6,7-tetrahydroindole-2,5-dicarboxylate::SMR000093486::cid_2997361
SMILES COC(=O)C1C(C)Cc2[nH]c(C(=O)OC3CCCCC3)c(C)c2C1=O
InChI Key InChIKey=SOUPFDNQACDAQX-UHFFFAOYSA-N
Data  2 EC50
  Tab Delimited (TSV)   2D SDfile   Computed 3D by Vconf -m prep SDfile
Find this compound or compounds like it in BindingDB:
Activity Spreadsheet -- Enzyme Inhibition Constant Data from BindingDB
Found 2 hits for monomerid = 44702
TargetOxysterols receptor LXR-beta(Homo sapiens (Human))
The Scripps Research Institute Molecular Screening Center
Curated by PubChem BioAssay
LigandPNGBDBM44702(2-O-cyclohexyl 5-O-methyl 3,6-dimethyl-4-oxo-1,5,6...)
Affinity DataEC50:  6.75E+4nM. Assay description: Source (MLPCN Center Name): The Scripps Research Institute Molecular Screening Center Affiliation: UT Southwestern Assay Provider: David Mangelsdorf,...
In DepthDetails PCBioAssay
TargetMultidrug resistance-associated protein 1(Homo sapiens (Human))
Srmlsc
Curated by PubChem BioAssay
LigandPNGBDBM44702(2-O-cyclohexyl 5-O-methyl 3,6-dimethyl-4-oxo-1,5,6...)
Affinity DataEC50:  3.74E+3nM. Assay description: Southern Research Molecular Libraries Screening Center (SRMLSC) Southern Research Institute (Birmingham, Alabama) NIH Molecular Libraries Screening C...
In DepthDetails PCBioAssay