BDBM44881 1-[bis(4-morpholinyl)phosphoryl]-N'-(4-methoxyphenyl)-N-(4-nitroanilino)methanimidamide::1-dimorpholin-4-ylphosphoryl-N'-(4-methoxyphenyl)-N-(4-nitroanilino)methanimidamide::1-dimorpholin-4-ylphosphoryl-N'-(4-methoxyphenyl)-N-[(4-nitrophenyl)amino]methanimidamide::1-dimorpholinophosphoryl-N'-(4-methoxyphenyl)-N-(4-nitroanilino)formamidine::MLS000532778::N-(4-methoxyphenyl)-1,1-di-4-morpholinyl-N'-(4-nitrophenyl)phosphinecarbohydrazonamide oxide::SMR000140216::cid_3769822
SMILES COc1ccc([N-]C(=[NH+]Nc2ccc(cc2)[N+]([O-])=O)P(=O)(N2CCOCC2)N2CCOCC2)cc1
InChI Key InChIKey=QDBSXBCTVBXXBB-UHFFFAOYSA-O
Data  1 EC50
  Tab Delimited (TSV)   2D SDfile   Computed 3D by Vconf -m prep SDfile
Find this compound or compounds like it in BindingDB:
Activity Spreadsheet -- Enzyme Inhibition Constant Data from BindingDB
Found 1 hit for monomerid = 44881
TargetMultidrug resistance-associated protein 1(Homo sapiens (Human))
Srmlsc
Curated by PubChem BioAssay
LigandPNGBDBM44881(1-[bis(4-morpholinyl)phosphoryl]-N'-(4-methoxyphen...)
Affinity DataEC50:  1.12E+3nM. Assay description: Southern Research Molecular Libraries Screening Center (SRMLSC) Southern Research Institute (Birmingham, Alabama) NIH Molecular Libraries Screening C...
In DepthDetails PCBioAssay