BDBM50018919 CHEMBL254578
SMILES OC(=O)C(\Cc1ccccc1[N+]([O-])=O)=N/Nc1nc(cs1)-c1ccc(Cl)c(Cl)c1
InChI Key InChIKey=KFRKRECSIYXARE-HMAPJEAMSA-N
Data  1 IC50  1 Kd
  Tab Delimited (TSV)   2D SDfile   Computed 3D by Vconf -m prep SDfile
Find this compound or compounds like it in BindingDB:
Activity Spreadsheet -- Enzyme Inhibition Constant Data from BindingDB
Found 2 hits for monomerid = 50018919
TargetEukaryotic translation initiation factor 4E(Homo sapiens (Human))
Harvard Medical School
Curated by ChEMBL
LigandPNGBDBM50018919(CHEMBL254578)
Affinity DataKd:  8.74E+6nM. Assay description: Binding affinity to human full length recombinant GST-tagged eIF4E expressed in Escherichia coli BL21(DE3) by intrinsic tryptophan fluorescence quenc...
In DepthDetails ArticlePubMed
TargetEukaryotic translation initiation factor 4E(Homo sapiens (Human))
Harvard Medical School
Curated by ChEMBL
LigandPNGBDBM50018919(CHEMBL254578)
Affinity DataIC50:  4.35E+4nM. Assay description: Displacement of N-alpha-fluorescein tagged eIF4G-derived peptide from GST-DN26-eIF4E (unknown origin) by fluorescence polarization assay
In DepthDetails ArticlePubMed