BDBM50072054 CHEMBL318016::{(S)-1-[(S)-2-((S)-2-Hydroxy-5-oxo-tetrahydro-furan-3-ylcarbamoyl)-pyrrolidine-1-carbonyl]-2-methyl-propyl}-carbamic acid benzyl ester
SMILES CC(C)[C@H](NC(=O)OCc1ccccc1)C(=O)N1CCC[C@H]1C(=O)N[C@H]1CC(=O)OC1O
InChI Key InChIKey=JGQBKVZBVBLNAV-SOTOXROOSA-N
Data  2 IC50
  Tab Delimited (TSV)   2D SDfile   Computed 3D by Vconf -m prep SDfile
Find this compound or compounds like it in BindingDB:
Activity Spreadsheet -- Enzyme Inhibition Constant Data from BindingDB
Found 2 hits for monomerid = 50072054
TargetCaspase-1(Mus musculus)
Idun Pharmaceuticals
Curated by ChEMBL
LigandPNGBDBM50072054(CHEMBL318016 | {(S)-1-[(S)-2-((S)-2-Hydroxy-5-oxo-...)
Affinity DataIC50:  87nM. Assay description: Inhibitory activity against Caspase-1 using Ac-TyrValAlaAsp-amc as substrate
In DepthDetails ArticlePubMed
TargetCaspase-3(Homo sapiens (Human))
Idun Pharmaceuticals
Curated by ChEMBL
LigandPNGBDBM50072054(CHEMBL318016 | {(S)-1-[(S)-2-((S)-2-Hydroxy-5-oxo-...)
Affinity DataIC50:  1.40E+4nM. Assay description: Inhibitory activity against human Caspase-3 using Ac-AspGluValAsp as substrate
In DepthDetails ArticlePubMed