BDBM50082666 4-(Dimethylamino)-N-[6-(hydroxyamino)-6-oxohexyl]benzenecarboxamide::4-Dimethylamino-N-(5-hydroxycarbamoyl-pentyl)-benzamide::CHEMBL46942
SMILES CN(C)c1ccc(cc1)C(=O)NCCCCCC(=O)NO
InChI Key InChIKey=RGWSSTALGUXZMU-UHFFFAOYSA-N
Data  8 IC50
  Tab Delimited (TSV)   2D SDfile   Computed 3D by Vconf -m prep SDfile
Find this compound or compounds like it in BindingDB:
Activity Spreadsheet -- Enzyme Inhibition Constant Data from BindingDB
Found 8 hits for monomerid = 50082666
TargetHistone deacetylase 2b(Zea mays)
WestfäLische Wilhelms-UniversitäT MüNster
Curated by ChEMBL
LigandPNGBDBM50082666(4-(Dimethylamino)-N-[6-(hydroxyamino)-6-oxohexyl]b...)
Affinity DataIC50:  100nM. Assay description: Inhibition of maize Histone deacetylase 2 (HD-2) activity
In DepthDetails ArticlePubMed
TargetHistone deacetylase 2b(Zea mays)
WestfäLische Wilhelms-UniversitäT MüNster
Curated by ChEMBL
LigandPNGBDBM50082666(4-(Dimethylamino)-N-[6-(hydroxyamino)-6-oxohexyl]b...)
Affinity DataIC50:  100nM. Assay description: Inhibitory concentration against maize Histone deacetylase 2
In DepthDetails ArticlePubMed
TargetHistone deacetylase(Rattus norvegicus)
Vrije Universiteit Brussel
Curated by ChEMBL
LigandPNGBDBM50082666(4-(Dimethylamino)-N-[6-(hydroxyamino)-6-oxohexyl]b...)
Affinity DataIC50:  152nM. Assay description: Inhibitory activity against histone deacetylase (HDAC)
In DepthDetails ArticlePubMed
TargetHistone deacetylase(Rattus norvegicus)
Vrije Universiteit Brussel
Curated by ChEMBL
LigandPNGBDBM50082666(4-(Dimethylamino)-N-[6-(hydroxyamino)-6-oxohexyl]b...)
Affinity DataIC50:  640nM. Assay description: Inhibitory concentration against rat liver histone deacetylase (HDAC) with substrate 5a
In DepthDetails ArticlePubMed
TargetHistone deacetylase(Rattus norvegicus)
Vrije Universiteit Brussel
Curated by ChEMBL
LigandPNGBDBM50082666(4-(Dimethylamino)-N-[6-(hydroxyamino)-6-oxohexyl]b...)
Affinity DataIC50:  153nM. Assay description: Inhibitory concentration against rat liver histone deacetylase (HDAC) with substrate 3b
In DepthDetails ArticlePubMed
TargetHistone deacetylase(Rattus norvegicus)
Vrije Universiteit Brussel
Curated by ChEMBL
LigandPNGBDBM50082666(4-(Dimethylamino)-N-[6-(hydroxyamino)-6-oxohexyl]b...)
Affinity DataIC50:  216nM. Assay description: Inhibitory concentration against rat liver histone deacetylase (HDAC) with substrate 3a
In DepthDetails ArticlePubMed
TargetHistone deacetylase(Homo sapiens (Human))
Westf£Lische Wilhelms-Universit£T M£Nster
Curated by ChEMBL
LigandPNGBDBM50082666(4-(Dimethylamino)-N-[6-(hydroxyamino)-6-oxohexyl]b...)
Affinity DataIC50:  1.87E+3nM. Assay description: Inhibitory concentration against human histone deacetylase (HDAC) from HeLa cells with substrate 5a
In DepthDetails ArticlePubMed
TargetHistone deacetylase(Homo sapiens (Human))
Westf£Lische Wilhelms-Universit£T M£Nster
Curated by ChEMBL
LigandPNGBDBM50082666(4-(Dimethylamino)-N-[6-(hydroxyamino)-6-oxohexyl]b...)
Affinity DataIC50:  244nM. Assay description: Concentration required to inhibit human Histone deacetylase (HDAC) enzyme by 50%
In DepthDetails ArticlePubMed