BDBM50086224 CHEMBL3425730
SMILES Cc1cc(C)cc(c1)-n1ccc(=O)c(O)c1C
InChI Key InChIKey=CJOYQPFROQSYCM-UHFFFAOYSA-N
Data  1 IC50
  Tab Delimited (TSV)   2D SDfile   Computed 3D by Vconf -m prep SDfile
Find this compound or compounds like it in BindingDB:
Activity Spreadsheet -- Enzyme Inhibition Constant Data from BindingDB
Found 1 hit for monomerid = 50086224
TargetCatechol O-methyltransferase(Homo sapiens (Human))
Merck Research Laboratories
Curated by ChEMBL
LigandPNGBDBM50086224(CHEMBL3425730)
Affinity DataIC50:  5.50E+3nM. Assay description: Inhibition of C-terminal His6-tagged recombinant human membrane bound COMT expressed in Bacmid infected Sf-9 insect cells using dopamine/SAM as subst...
In DepthDetails ArticlePubMed