BDBM50168876 3-{4-Oxo-5-[1-phenyl-meth-(Z)-ylidene]-2-thioxo-thiazolidin-3-yl}-benzoic acid::CHEMBL183967
SMILES OC(=O)c1cccc(c1)N1C(=S)S\C(=C/c2ccccc2)C1=O
InChI Key InChIKey=ZXNFVGYFPHSNJJ-ZROIWOOFSA-N
Data  4 IC50
  Tab Delimited (TSV)   2D SDfile   Computed 3D by Vconf -m prep SDfile
Find this compound or compounds like it in BindingDB:
Activity Spreadsheet -- Enzyme Inhibition Constant Data from BindingDB
Found 4 hits for monomerid = 50168876
TargetDual specificity protein phosphatase 22(Homo sapiens (Human))
Ceptyr
Curated by ChEMBL
LigandPNGBDBM50168876(3-{4-Oxo-5-[1-phenyl-meth-(Z)-ylidene]-2-thioxo-th...)
Affinity DataIC50:  7.00E+3nM. Assay description: Inhibition of JNK-stimulating phosphatase-1 (JSP-1)
In DepthDetails ArticlePubMed
TargetDual specificity protein phosphatase 22(Homo sapiens (Human))
Ceptyr
Curated by ChEMBL
LigandPNGBDBM50168876(3-{4-Oxo-5-[1-phenyl-meth-(Z)-ylidene]-2-thioxo-th...)
Affinity DataIC50:  7.00E+3nM. Assay description: Inhibition of JNK-stimulating phosphatase-1 (JSP-1)
In DepthDetails ArticlePubMed
TargetDual specificity protein phosphatase 3(Homo sapiens (Human))
Ceptyr
Curated by ChEMBL
LigandPNGBDBM50168876(3-{4-Oxo-5-[1-phenyl-meth-(Z)-ylidene]-2-thioxo-th...)
Affinity DataIC50: >1.00E+5nM. Assay description: In vitro inhibitory concentration against VH1-related (VHR) phosphatase
In DepthDetails ArticlePubMed
TargetDual specificity protein phosphatase 3(Homo sapiens (Human))
Ceptyr
Curated by ChEMBL
LigandPNGBDBM50168876(3-{4-Oxo-5-[1-phenyl-meth-(Z)-ylidene]-2-thioxo-th...)
Affinity DataIC50: >1.00E+5nM. Assay description: In vitro inhibitory concentration against VH1-related (VHR) phosphatase
In DepthDetails ArticlePubMed