BDBM50205428 CHEMBL230471::N3-butyl-N1-(2,3-di(furan-2-yl)quinoxalin-6-yl)-N3-methylpiperidine-1,3-dicarboxamide
SMILES CCCCN(C)C(=O)C1CCCN(C1)C(=O)Nc1ccc2nc(-c3ccco3)c(nc2c1)-c1ccco1
InChI Key InChIKey=CNPOFOVWAAIKCB-UHFFFAOYSA-N
Data  1 IC50
  Tab Delimited (TSV)   2D SDfile   Computed 3D by Vconf -m prep SDfile
Find this compound or compounds like it in BindingDB:
Activity Spreadsheet -- Enzyme Inhibition Constant Data from BindingDB
Found 1 hit for monomerid = 50205428
TargetDual specificity protein phosphatase 22(Homo sapiens (Human))
Chinese Academy Of Sciences
Curated by ChEMBL
LigandPNGBDBM50205428(CHEMBL230471 | N3-butyl-N1-(2,3-di(furan-2-yl)quin...)
Affinity DataIC50:  5.55E+3nM. Assay description: Inhibition of GST-tagged human recombinant JSP1
In DepthDetails ArticlePubMed