BDBM50205436 CHEMBL230362::N-(2,3-bis(4-bromophenyl)quinoxalin-6-yl)-3-(pyrrolidine-1-carbonyl)piperidine-1-carboxamide
SMILES Brc1ccc(cc1)-c1nc2ccc(NC(=O)N3CCCC(C3)C(=O)N3CCCC3)cc2nc1-c1ccc(Br)cc1
InChI Key InChIKey=YGCSLQKNFQPTKJ-UHFFFAOYSA-N
Data  1 IC50
  Tab Delimited (TSV)   2D SDfile   Computed 3D by Vconf -m prep SDfile
Find this compound or compounds like it in BindingDB:
Activity Spreadsheet -- Enzyme Inhibition Constant Data from BindingDB
Found 1 hit for monomerid = 50205436
TargetDual specificity protein phosphatase 22(Homo sapiens (Human))
Chinese Academy Of Sciences
Curated by ChEMBL
LigandPNGBDBM50205436(CHEMBL230362 | N-(2,3-bis(4-bromophenyl)quinoxalin...)
Affinity DataIC50: >4.00E+4nM. Assay description: Inhibition of GST-tagged human recombinant JSP1
In DepthDetails ArticlePubMed