BDBM50378639 CHEMBL599018::US8637558, 37
SMILES CC1CCC(COc2ccc(C=C3SC(O)=NC3=O)cc2)CC1
InChI Key InChIKey=LSMFQERSGNTVHF-UHFFFAOYSA-N
Data  2 IC50
  Tab Delimited (TSV)   2D SDfile   Computed 3D by Vconf -m prep SDfile
Find this compound or compounds like it in BindingDB:
Activity Spreadsheet -- Enzyme Inhibition Constant Data from BindingDB
Found 2 hits for monomerid = 50378639
Target15-hydroxyprostaglandin dehydrogenase [NAD(+)](Homo sapiens (Human))
Chosun University
Curated by ChEMBL
LigandPNGBDBM50378639(CHEMBL599018 | US8637558, 37)
Affinity DataIC50:  52nM. Assay description: Inhibition of human 15PGDH expressed in Escherichia coli BL-21 by fluorescence spectrophotometry
In DepthDetails ArticlePubMed
Target15-hydroxyprostaglandin dehydrogenase [NAD(+)](Homo sapiens (Human))
Chosun University
Curated by ChEMBL
LigandPNGBDBM50378639(CHEMBL599018 | US8637558, 37)
Affinity DataIC50:  66.4nMpH: 7.5Assay Description:Experimental was performed by measuring the formation of NADH at 340 nm with a fluorescence spectrophotometer. Specifically, 2 ml (in total) of the s...
In DepthDetails US Patent