BDBM52074 3-Methoxy-N-{1-[4-(morpholine-4-sulfonyl)-phenyl]-piperidin-4-ylmethyl}-benzamide::3-methoxy-N-[[1-(4-morpholin-4-ylsulfonylphenyl)piperidin-4-yl]methyl]benzamide::3-methoxy-N-[[1-(4-morpholinosulfonylphenyl)-4-piperidyl]methyl]benzamide::3-methoxy-N-[[1-[4-(4-morpholinylsulfonyl)phenyl]-4-piperidinyl]methyl]benzamide::MLS000068063::SMR000000946::cid_651404
SMILES COc1cccc(c1)C(=O)NCC1CCN(CC1)c1ccc(cc1)S(=O)(=O)N1CCOCC1
InChI Key InChIKey=GXODBJWILLCLPC-UHFFFAOYSA-N
Data  2 EC50
  Tab Delimited (TSV)   2D SDfile   Computed 3D by Vconf -m prep SDfile
Find this compound or compounds like it in BindingDB:
Activity Spreadsheet -- Enzyme Inhibition Constant Data from BindingDB
Found 2 hits for monomerid = 52074
TargetZinc finger protein mex-5(Caenorhabditis elegans)
Broad Institute
Curated by PubChem BioAssay
LigandPNGBDBM52074(3-Methoxy-N-{1-[4-(morpholine-4-sulfonyl)-phenyl]-...)
Affinity DataEC50:  3.00E+5nM. Assay description: Broad Institute: MLPCN maternal gene expression Project ID: 2024 Keywords: Zinc finger, C. elegans, maternal gene expression, RNA-protein interac...
In DepthDetails PCBioAssay
TargetPOsterior Segregation(Caenorhabditis elegans)
Broad Institute
Curated by PubChem BioAssay
LigandPNGBDBM52074(3-Methoxy-N-{1-[4-(morpholine-4-sulfonyl)-phenyl]-...)
Affinity DataEC50:  3.00E+5nM. Assay description: Broad Institute: MLPCN maternal gene expression Project ID: 2024 Keywords: Zinc finger, C. elegans, maternal gene expression, RNA-protein interac...
In DepthDetails PCBioAssay