BDBM76396 2-(4-Bromo-phenyl)-6,7,8,9-tetrahydro-benzo[e]imidazo[1,2-b][1,2,4]triazine::2-(4-bromophenyl)-6,7,8,9-tetrahydroimidazo[1,2-b][1,2,4]benzotriazine::MLS000554660::SMR000146777::cid_630093
SMILES Brc1ccc(cc1)-c1cn2nc3CCCCc3nc2n1
InChI Key InChIKey=CLBFAKALONTKBD-UHFFFAOYSA-N
Data  4 IC50
  Tab Delimited (TSV)   2D SDfile   Computed 3D by Vconf -m prep SDfile
Find this compound or compounds like it in BindingDB:
Activity Spreadsheet -- Enzyme Inhibition Constant Data from BindingDB
Found 4 hits for monomerid = 76396
TargetSentrin-specific protease 8(Homo sapiens (Human))
Burnham Center For Chemical Genomics
Curated by PubChem BioAssay
LigandPNGBDBM76396(2-(4-Bromo-phenyl)-6,7,8,9-tetrahydro-benzo[e]imid...)
Affinity DataIC50:  1.77E+4nM. Assay description: Data Source: Sanford-Burnham Center for Chemical Genomics (SBCCG) Source Affiliation: Sanford-Burnham Medical Research Institute (SBMRI, San Diego, C...
In DepthDetails PCBioAssay
TargetProtein artemis(Homo sapiens (Human))
Burnham Center For Chemical Genomics
Curated by PubChem BioAssay
LigandPNGBDBM76396(2-(4-Bromo-phenyl)-6,7,8,9-tetrahydro-benzo[e]imid...)
Affinity DataIC50:  2.00E+4nM. Assay description: Data Source: Sanford-Burnham Center for Chemical Genomics (SBCCG) Source Affiliation: Sanford-Burnham Medical Research Institute (SBMRI, San Diego CA...
In DepthDetails PCBioAssay
TargetCaspase-3(Homo sapiens (Human))
Burnham Center For Chemical Genomics
Curated by PubChem BioAssay
LigandPNGBDBM76396(2-(4-Bromo-phenyl)-6,7,8,9-tetrahydro-benzo[e]imid...)
Affinity DataIC50:  1.74E+4nM. Assay description: Data Source: Sanford-Burnham Center for Chemical Genomics (SBCCG) Source Affiliation: Sanford-Burnham Medical Research Institute (SBMRI, San Diego, C...
In DepthDetails PCBioAssay
TargetSentrin-specific protease 6(Homo sapiens (Human))
Burnham Center For Chemical Genomics
Curated by PubChem BioAssay
LigandPNGBDBM76396(2-(4-Bromo-phenyl)-6,7,8,9-tetrahydro-benzo[e]imid...)
Affinity DataIC50:  1.23E+4nM. Assay description: Data Source: Sanford-Burnham Center for Chemical Genomics (SBCCG) Source Affiliation: Sanford-Burnham Medical Research Institute (SBMRI, San Diego, C...
In DepthDetails PCBioAssay