BDBM76675 (2Z)-2-(3-fluorobenzylidene)-6-hydroxy-coumaran-3-one::(2Z)-2-[(3-fluorophenyl)methylidene]-6-hydroxy-1-benzofuran-3-one::(2Z)-2-[(3-fluorophenyl)methylidene]-6-hydroxy-3-benzofuranone::(2Z)-2-[(3-fluorophenyl)methylidene]-6-oxidanyl-1-benzofuran-3-one::MLS001215086::SMR000543181::cid_939330
SMILES Oc1ccc2C(=O)\C(Oc2c1)=C\c1cccc(F)c1
InChI Key InChIKey=CISJJIPWRRRGMU-AUWJEWJLSA-N
Data  3 IC50
  Tab Delimited (TSV)   2D SDfile   Computed 3D by Vconf -m prep SDfile
Find this compound or compounds like it in BindingDB:
Activity Spreadsheet -- Enzyme Inhibition Constant Data from BindingDB
Found 3 hits for monomerid = 76675
TargetSentrin-specific protease 6(Homo sapiens (Human))
Burnham Center For Chemical Genomics
Curated by PubChem BioAssay
LigandPNGBDBM76675((2Z)-2-(3-fluorobenzylidene)-6-hydroxy-coumaran-3-...)
Affinity DataIC50:  1.59E+4nM. Assay description: Data Source: Sanford-Burnham Center for Chemical Genomics (SBCCG) Source Affiliation: Sanford-Burnham Medical Research Institute (SBMRI, San Diego, C...
In DepthDetails PCBioAssay
TargetSentrin-specific protease 8(Homo sapiens (Human))
Burnham Center For Chemical Genomics
Curated by PubChem BioAssay
LigandPNGBDBM76675((2Z)-2-(3-fluorobenzylidene)-6-hydroxy-coumaran-3-...)
Affinity DataIC50:  2.29E+3nM. Assay description: Data Source: Sanford-Burnham Center for Chemical Genomics (SBCCG) Source Affiliation: Sanford-Burnham Medical Research Institute (SBMRI, San Diego, C...
In DepthDetails PCBioAssay
TargetCaspase-3(Homo sapiens (Human))
Burnham Center For Chemical Genomics
Curated by PubChem BioAssay
LigandPNGBDBM76675((2Z)-2-(3-fluorobenzylidene)-6-hydroxy-coumaran-3-...)
Affinity DataIC50:  1.82E+4nM. Assay description: Data Source: Sanford-Burnham Center for Chemical Genomics (SBCCG) Source Affiliation: Sanford-Burnham Medical Research Institute (SBMRI, San Diego, C...
In DepthDetails PCBioAssay