BDBM77494 6-butoxy-7-methyl-8-pyrrolo[2,3-g][2,1,3]benzoxadiazolecarboxylic acid ethyl ester::6-butoxy-7-methyl-pyrrolo[2,3-g][2,1,3]benzoxadiazole-8-carboxylic acid ethyl ester::MLS000043184::SMR000019805::cid_3237885::ethyl 6-butoxy-7-methyl-6H-[1,2,5]oxadiazolo[3,4-e]indole-8-carboxylate::ethyl 6-butoxy-7-methyl-pyrrolo[2,3-g][2,1,3]benzoxadiazole-8-carboxylate::ethyl 6-butoxy-7-methylpyrrolo[2,3-g][2,1,3]benzoxadiazole-8-carboxylate
SMILES CCCCOn1c(C)c(C(=O)OCC)c2c1ccc1nonc21
InChI Key InChIKey=KVAQWFKBVRFFBV-UHFFFAOYSA-N
Data  2 EC50
  Tab Delimited (TSV)   2D SDfile   Computed 3D by Vconf -m prep SDfile
Find this compound or compounds like it in BindingDB:
Activity Spreadsheet -- Enzyme Inhibition Constant Data from BindingDB
Found 2 hits for monomerid = 77494
TargetCaspase-3(Homo sapiens (Human))
The Scripps Research Institute Molecular Screening Center
Curated by PubChem BioAssay
LigandPNGBDBM77494(6-butoxy-7-methyl-8-pyrrolo[2,3-g][2,1,3]benzoxadi...)
Affinity DataEC50: >8.53E+4nM. Assay description: Source (MLPCN Center Name): The Scripps Research Institute Molecular Screening Center (SRIMSC) Affiliation: The Scripps Research Institute, TSR...
In DepthDetails PCBioAssay
TargetCaspase-7(Homo sapiens (Human))
The Scripps Research Institute Molecular Screening Center
Curated by PubChem BioAssay
LigandPNGBDBM77494(6-butoxy-7-methyl-8-pyrrolo[2,3-g][2,1,3]benzoxadi...)
Affinity DataEC50: >8.53E+4nM. Assay description: Source (MLPCN Center Name): The Scripps Research Institute Molecular Screening Center (SRIMSC) Affiliation: The Scripps Research Institute, TSR...
In DepthDetails PCBioAssay