BDBM96299 (3,5-dimethylphenyl)-(5-naphthalen-2-yl-1H-imidazol-2-yl)methanol::(3,5-dimethylphenyl)-[5-(2-naphthalenyl)-1H-imidazol-2-yl]methanol::(3,5-dimethylphenyl)-[5-(2-naphthyl)-1H-imidazol-2-yl]methanol::MLS003123567::SMR001291538::cid_49790119
SMILES Cc1cc(C)cc(c1)C(O)c1nc(c[nH]1)-c1ccc2ccccc2c1
InChI Key InChIKey=HZCAWYVJOBSPKH-UHFFFAOYSA-N
Data  1 IC50
  Tab Delimited (TSV)   2D SDfile   Computed 3D by Vconf -m prep SDfile
Find this compound or compounds like it in BindingDB:
Activity Spreadsheet -- Enzyme Inhibition Constant Data from BindingDB
Found 1 hit for monomerid = 96299
TargetRecBCD enzyme subunit RecD(Escherichia coli str. K-12 substr. MG1655)
The Scripps Research Institute Molecular Screening Center
Curated by PubChem BioAssay
LigandPNGBDBM96299((3,5-dimethylphenyl)-(5-naphthalen-2-yl-1H-imidazo...)
Affinity DataIC50: >1.19E+5nM
In DepthDetails PCBioAssay