Target
Complement factor D
Ligand
BDBM303059
Substrate
Meas. Tech.
Factor D Assay
IC50
<1000±n/a nM
Citation
 Gadhachanda, VRHashimoto, APais, GWang, QChen, DWang, XAgarwal, ADeshpande, MWiles, JAPhadke, AS Amino compounds for treatment of complement mediated disorders US Patent  US9598446 Publication Date 3/21/2017 
Target
Name:
Complement factor D
Synonyms:
Adipsin CFAD_HUMAN DF Properdin factor D
Type:
Protein
Mol. Mass.:
27039.19
Organism:
Homo sapiens (Human)
Description:
P00746
Residue:
253
  
Inhibitor
Name:
BDBM303059
Synonyms:
(2S,4R)-1-(2-(3- acetyl-5-(pyrimidin-5- ylamino)-1H-indol-1- yl)acetyl)-4-fluoro-N- (1-(1-methyl-1H- pyrazol-3-yl)-2- oxopyrrolidin-3- yl)pyrrolidine-2- carboxamide US9598446, Compound 64
Type:
Small organic molecule
Emp. Form.:
C29H30FN9O4
Mol. Mass.:
587.6048
SMILES:
CC(=O)c1cn(CC(=O)N2C[C@H](F)C[C@H]2C(=O)NC2CCN(C2=O)c2ccn(C)n2)c2ccc(Nc3cncnc3)cc12
: