Target
Proto-oncogene tyrosine-protein kinase receptor Ret
Ligand
BDBM296515
Substrate
Meas. Tech.
RET Enzyme Assay
IC50
10.6±n/a nM
Citation
 Andrews, SWAronow, SBlake, JFBrandhuber, BJCook, AHaas, JJiang, YKolakowski, GRMcFaddin, EAMcKenney, MLMcNulty, OTMetcalf, ATMoreno, DATang, TPRen, L Substituted pyrazolo[1,5-a]pyridine compounds as RET kinase inhibitors US Patent  US10137124 Publication Date 11/27/2018 
Target
Name:
Proto-oncogene tyrosine-protein kinase receptor Ret
Synonyms:
CDHF12 Cadherin family member 12 Proto-oncogene c-Ret RET51 Tyrosine-protein kinase Ret (RET)
Type:
Protein
Mol. Mass.:
124318.29
Organism:
Homo sapiens (Human)
Description:
P07949
Residue:
1114
  
Inhibitor
Name:
BDBM296515
Synonyms:
US10112942, Example 249 US10172851, Example 249 US10953005, Example 249
Type:
Small organic molecule
Emp. Form.:
C32H31N7O2
Mol. Mass.:
545.6342
SMILES:
CC(C)(O)COc1cc(-c2ccc(nc2)N2CC3CC(C2)N3Cc2ccc3ncccc3c2)c2c(cnn2c1)C#N
: