Target
Proto-oncogene tyrosine-protein kinase receptor Ret
Ligand
BDBM296710
Substrate
Meas. Tech.
RET Enzyme Assay
IC50
8.20±n/a nM
Citation
 Andrews, SWAronow, SBlake, JFBrandhuber, BJCook, AHaas, JJiang, YKolakowski, GRMcFaddin, EAMcKenney, MLMcNulty, OTMetcalf, ATMoreno, DATang, TPRen, L Substituted pyrazolo[1,5-a]pyridine compounds as RET kinase inhibitors US Patent  US10137124 Publication Date 11/27/2018 
Target
Name:
Proto-oncogene tyrosine-protein kinase receptor Ret
Synonyms:
CDHF12 Cadherin family member 12 Proto-oncogene c-Ret RET51 Tyrosine-protein kinase Ret (RET)
Type:
Protein
Mol. Mass.:
124318.29
Organism:
Homo sapiens (Human)
Description:
P07949
Residue:
1114
  
Inhibitor
Name:
BDBM296710
Synonyms:
US10112942, Example 445 US10172851, Example 445 US10953005, Example 445
Type:
Small organic molecule
Emp. Form.:
C35H42N8O3
Mol. Mass.:
622.7598
SMILES:
COCCN1CCC(CCOc2cc(-c3ccc(nc3)N3CC4CC(C3)N4Cc3ccc(OC)nc3)c3c(cnn3c2)C#N)CC1
: