Target
Proto-oncogene tyrosine-protein kinase receptor Ret
Ligand
BDBM296735
Substrate
Meas. Tech.
RET Enzyme Assay
IC50
5.50±n/a nM
Citation
 Andrews, SWAronow, SBlake, JFBrandhuber, BJCook, AHaas, JJiang, YKolakowski, GRMcFaddin, EAMcKenney, MLMcNulty, OTMetcalf, ATMoreno, DATang, TPRen, L Substituted pyrazolo[1,5-a]pyridine compounds as RET kinase inhibitors US Patent  US10137124 Publication Date 11/27/2018 
Target
Name:
Proto-oncogene tyrosine-protein kinase receptor Ret
Synonyms:
CDHF12 Cadherin family member 12 Proto-oncogene c-Ret RET51 Tyrosine-protein kinase Ret (RET)
Type:
Protein
Mol. Mass.:
124318.29
Organism:
Homo sapiens (Human)
Description:
P07949
Residue:
1114
  
Inhibitor
Name:
BDBM296735
Synonyms:
US10112942, Example 470 US10172851, Example 470 US10953005, Example 470
Type:
Small organic molecule
Emp. Form.:
C30H29N9O2
Mol. Mass.:
547.6104
SMILES:
COc1ccc(CN2C3CC2CN(C3)c2ccc(cn2)-c2cc(OCCn3ccnc3)cn3ncc(C#N)c23)cn1
: