Target
Ectonucleotide pyrophosphatase/phosphodiesterase family member 2
Ligand
BDBM303657
Substrate
Meas. Tech.
Quanta Red Assay
IC50
1.000±n/a nM
Citation
 Blum, FCarr, JLShah, PDel Mar Jimenez Quesada, MGutierrez, IF Autotaxin inhibitors US Patent  US10138230 Publication Date 11/27/2018 
Target
Name:
Ectonucleotide pyrophosphatase/phosphodiesterase family member 2
Synonyms:
ATX Autotaxin (ATX) ENPP2 Ectonucleotide Pyrophosphatase/Phosphodiesterase 2 (ENPP2) Extracellular lysophospholipase D PDNP2
Type:
Enzyme
Mol. Mass.:
99007.13
Organism:
Homo sapiens (Human)
Description:
Q13822
Residue:
863
  
Inhibitor
Name:
BDBM303657
Synonyms:
(3S)-N-[5-[2-(4- chlorophenyl)ethyl]- 1,3,4-thiadiazol-2-yl]-1- [4- [[methyl(tetrahydrofuran- 3- yl)amino]methyl]phenyl]- 5-oxo-pyrrolidine-3- carboxamide | US10138230, Example F87
Type:
Small organic molecule
Emp. Form.:
C27H30ClN5O3S
Mol. Mass.:
540.077
SMILES:
[H][C@]1(CN(C(=O)C1)c1ccc(CN(C)C2CCOC2)cc1)C(=O)Nc1nnc(CCc2ccc(Cl)cc2)s1
: