Target
Ectonucleotide pyrophosphatase/phosphodiesterase family member 2
Ligand
BDBM303696
Substrate
Meas. Tech.
Quanta Red Assay
IC50
8.00±n/a nM
Citation
 Blum, FCarr, JLShah, PDel Mar Jimenez Quesada, MGutierrez, IF Autotaxin inhibitors US Patent  US10138230 Publication Date 11/27/2018 
Target
Name:
Ectonucleotide pyrophosphatase/phosphodiesterase family member 2
Synonyms:
ATX Autotaxin (ATX) ENPP2 Ectonucleotide Pyrophosphatase/Phosphodiesterase 2 (ENPP2) Extracellular lysophospholipase D PDNP2
Type:
Enzyme
Mol. Mass.:
99007.13
Organism:
Homo sapiens (Human)
Description:
Q13822
Residue:
863
  
Inhibitor
Name:
BDBM303696
Synonyms:
(3S)-N-[6-[2-(4- fluorophenyl)ethyl] pyridazin- 3-yl]-1-[4- [[methyl(tetrahydropyran- 4- yl)amino]methyl]phenyl]- 5-oxo-pyrrolidine-3- carboxamide | US10138230, Example F126
Type:
Small organic molecule
Emp. Form.:
C30H34FN5O3
Mol. Mass.:
531.6211
SMILES:
[H][C@]1(CN(C(=O)C1)c1ccc(CN(C)C2CCOCC2)cc1)C(=O)Nc1ccc(CCc2ccc(F)cc2)nn1
: